<?xml version="1.0" encoding="UTF-8"?><rss version="2.0"
	xmlns:content="http://purl.org/rss/1.0/modules/content/"
	xmlns:wfw="http://wellformedweb.org/CommentAPI/"
	xmlns:dc="http://purl.org/dc/elements/1.1/"
	xmlns:atom="http://www.w3.org/2005/Atom"
	xmlns:sy="http://purl.org/rss/1.0/modules/syndication/"
	xmlns:slash="http://purl.org/rss/1.0/modules/slash/"
	>

<channel>
	<title>npm run development Archives - scmGalaxy</title>
	<atom:link href="https://www.scmgalaxy.com/tutorials/tag/npm-run-development/feed/" rel="self" type="application/rss+xml" />
	<link>https://www.scmgalaxy.com/tutorials/tag/npm-run-development/</link>
	<description>A Platform for Software Engineers</description>
	<lastBuildDate>Wed, 13 Apr 2022 16:34:46 +0000</lastBuildDate>
	<language>en-US</language>
	<sy:updatePeriod>
	hourly	</sy:updatePeriod>
	<sy:updateFrequency>
	1	</sy:updateFrequency>
	<generator>https://wordpress.org/?v=7.1</generator>
	<item>
		<title>error in ./resources/assets/sass/app.scss</title>
		<link>https://www.scmgalaxy.com/tutorials/error-in-resources-assets-sass-app-scss/</link>
					<comments>https://www.scmgalaxy.com/tutorials/error-in-resources-assets-sass-app-scss/#respond</comments>
		
		<dc:creator><![CDATA[Ashwani Kumar]]></dc:creator>
		<pubDate>Sat, 07 Aug 2021 12:05:32 +0000</pubDate>
				<category><![CDATA[Node js]]></category>
		<category><![CDATA[dart-sass]]></category>
		<category><![CDATA[error in ./resources/assets/sass/app.scss]]></category>
		<category><![CDATA[Node]]></category>
		<category><![CDATA[node-sass]]></category>
		<category><![CDATA[node-sass not found]]></category>
		<category><![CDATA[nodejs]]></category>
		<category><![CDATA[not found]]></category>
		<category><![CDATA[npm]]></category>
		<category><![CDATA[npm err!]]></category>
		<category><![CDATA[NPM error]]></category>
		<category><![CDATA[npm run development]]></category>
		<guid isPermaLink="false">https://www.scmgalaxy.com/tutorials/?p=7586</guid>

					<description><![CDATA[<p>If you are getting this error (error in ./resources/assets/sass/app.scss) in Node module please follow some steps which is have mentioned [&#8230;]</p>
<p>The post <a href="https://www.scmgalaxy.com/tutorials/error-in-resources-assets-sass-app-scss/">error in ./resources/assets/sass/app.scss</a> appeared first on <a href="https://www.scmgalaxy.com/tutorials">scmGalaxy</a>.</p>
]]></description>
										<content:encoded><![CDATA[
<p class="wp-block-paragraph">If you are getting this error (error in ./resources/assets/sass/app.scss) in Node module please follow some steps which is have mentioned in the following</p>



<h4 class="wp-block-heading">Error:-</h4>



<p class="wp-block-paragraph">Many of you get this error when you did not change anything in <code>app.scss</code>, but when I run <code>npm run watch</code> I get the following errors:</p>



<pre class="wp-block-code"><code><span class="has-inline-color has-vivid-cyan-blue-color"> error  in ./resources/sass/app.scss                                                                      

Module build failed (from ./node_modules/sass-loader/lib/loader.js):                                      
Unsupported operation: Cannot extract a file path from a URI with a fragment component                    

@ ./resources/sass/app.scss 2:14-254                                                                     

    Asset      Size   Chunks             Chunk Names                                                     
/js/app.js  2.46 MiB  /js/app  &#91;emitted]  /js/app                                                         

ERROR in ./resources/sass/app.scss                                                                        
Module build failed (from ./node_modules/css-loader/index.js):                                            
ModuleBuildError: Module build failed (from ./node_modules/sass-loader/lib/loader.js):                    

undefined                                                                                                 
      ^                                                                                                  
      Join(null, "variables"): part 0 was null, but part 1 was not.                                       
@import 'variables';                                                                                      
        ^^^^^^^^^^^                                                                                       
  stdin 2:9  root stylesheet                                                                              
      in C:\Users\TAQI VAHEED\Desktop\#Coding\resPro\resources\sass\app.scss (line 2, column 9)           
    at runLoaders (C:\Users\TAQI VAHEED\Desktop\#Coding\resPro\node_modules\webpack\lib\NormalModule.js:30
    at C:\Users\TAQI VAHEED\Desktop\#Coding\resPro\node_modules\loader-runner\lib\LoaderRunner.js:364:11  
    at C:\Users\TAQI VAHEED\Desktop\#Coding\resPro\node_modules\loader-runner\lib\LoaderRunner.js:230:18  
    at context.callback (C:\Users\TAQI VAHEED\Desktop\#Coding\resPro\node_modules\loader-runner\lib\Loader
13)</span></code></pre>



<h4 class="wp-block-heading">Solution:-</h4>



<p class="wp-block-paragraph">The main issue which we have found that is related to<code><span class="has-inline-color has-vivid-red-color"> dart-sass</span></code> being used instead of <code><span class="has-inline-color has-vivid-red-color">node-sass</span></code> with <code>laravel</code></p>



<p class="wp-block-paragraph">You have to just follow one step:-</p>



<p class="wp-block-paragraph"><strong>Step 1:-</strong> You have to run this Command and all the things will solve .</p>



<pre class="wp-block-code"><code><span class="has-inline-color has-vivid-red-color">npm install node-sass</span></code></pre>



<p class="wp-block-paragraph"></p>
<p>The post <a href="https://www.scmgalaxy.com/tutorials/error-in-resources-assets-sass-app-scss/">error in ./resources/assets/sass/app.scss</a> appeared first on <a href="https://www.scmgalaxy.com/tutorials">scmGalaxy</a>.</p>
]]></content:encoded>
					
					<wfw:commentRss>https://www.scmgalaxy.com/tutorials/error-in-resources-assets-sass-app-scss/feed/</wfw:commentRss>
			<slash:comments>0</slash:comments>
		
		
			</item>
		<item>
		<title>How to solve throwing npm error “npm ERR! code ELIFECYCLE” &#8220;npm ERR! errno 2&#8221; &#8220;npm ERR! @ dev: `npm run development`&#8221;</title>
		<link>https://www.scmgalaxy.com/tutorials/how-to-solve-throwing-npm-error-npm-err-code-elifecycle-npm-err-errno-2-npm-err-dev-npm-run-development/</link>
		
		<dc:creator><![CDATA[rajeshkumar]]></dc:creator>
		<pubDate>Sat, 24 Apr 2021 11:28:21 +0000</pubDate>
				<category><![CDATA[Laravel]]></category>
		<category><![CDATA[elifecycle]]></category>
		<category><![CDATA[errno 2]]></category>
		<category><![CDATA[NPM error]]></category>
		<category><![CDATA[npm run development]]></category>
		<guid isPermaLink="false">https://www.scmgalaxy.com/tutorials/?p=5988</guid>

					<description><![CDATA[<p>When you using &#8220;laravel 5.5&#8221; and whenever run command &#8220;npm install&#8221; then sometime it comes this type error. Then run [&#8230;]</p>
<p>The post <a href="https://www.scmgalaxy.com/tutorials/how-to-solve-throwing-npm-error-npm-err-code-elifecycle-npm-err-errno-2-npm-err-dev-npm-run-development/">How to solve throwing npm error “npm ERR! code ELIFECYCLE” &#8220;npm ERR! errno 2&#8221; &#8220;npm ERR! @ dev: `npm run development`&#8221;</a> appeared first on <a href="https://www.scmgalaxy.com/tutorials">scmGalaxy</a>.</p>
]]></description>
										<content:encoded><![CDATA[
<p class="wp-block-paragraph">When you using &#8220;laravel 5.5&#8221; and whenever run command &#8220;npm install&#8221; then sometime it comes this type error.</p>



<p class="wp-block-paragraph"></p>



<figure class="wp-block-image size-large"><img fetchpriority="high" decoding="async" width="1024" height="283" src="https://www.scmgalaxy.com/tutorials/wp-content/uploads/2021/04/npm-ERR-code-ELIFECYCLE-1024x283.png" alt="" class="wp-image-5992" srcset="https://www.scmgalaxy.com/tutorials/wp-content/uploads/2021/04/npm-ERR-code-ELIFECYCLE-1024x283.png 1024w, https://www.scmgalaxy.com/tutorials/wp-content/uploads/2021/04/npm-ERR-code-ELIFECYCLE-300x83.png 300w, https://www.scmgalaxy.com/tutorials/wp-content/uploads/2021/04/npm-ERR-code-ELIFECYCLE-768x213.png 768w, https://www.scmgalaxy.com/tutorials/wp-content/uploads/2021/04/npm-ERR-code-ELIFECYCLE-1536x425.png 1536w, https://www.scmgalaxy.com/tutorials/wp-content/uploads/2021/04/npm-ERR-code-ELIFECYCLE.png 1684w" sizes="(max-width: 1024px) 100vw, 1024px" /></figure>



<p class="wp-block-paragraph"></p>



<figure class="wp-block-image size-large"><img decoding="async" width="1024" height="388" src="https://www.scmgalaxy.com/tutorials/wp-content/uploads/2021/04/npm-ERR-errno-2-npm-ERR-@-dev-npm-run-development-1024x388.png" alt="" class="wp-image-5993" srcset="https://www.scmgalaxy.com/tutorials/wp-content/uploads/2021/04/npm-ERR-errno-2-npm-ERR-@-dev-npm-run-development-1024x388.png 1024w, https://www.scmgalaxy.com/tutorials/wp-content/uploads/2021/04/npm-ERR-errno-2-npm-ERR-@-dev-npm-run-development-300x114.png 300w, https://www.scmgalaxy.com/tutorials/wp-content/uploads/2021/04/npm-ERR-errno-2-npm-ERR-@-dev-npm-run-development-768x291.png 768w, https://www.scmgalaxy.com/tutorials/wp-content/uploads/2021/04/npm-ERR-errno-2-npm-ERR-@-dev-npm-run-development.png 1345w" sizes="(max-width: 1024px) 100vw, 1024px" /></figure>



<p class="wp-block-paragraph">Then run below commands &#8211;</p>



<h2 class="wp-block-heading">Step 1-</h2>



<p class="wp-block-paragraph"><strong>npm install &#8211;save-dev cross-env</strong></p>



<figure class="wp-block-image size-large"><img decoding="async" width="1024" height="593" src="https://www.scmgalaxy.com/tutorials/wp-content/uploads/2021/04/image-32-1024x593.png" alt="" class="wp-image-5989" srcset="https://www.scmgalaxy.com/tutorials/wp-content/uploads/2021/04/image-32-1024x593.png 1024w, https://www.scmgalaxy.com/tutorials/wp-content/uploads/2021/04/image-32-300x174.png 300w, https://www.scmgalaxy.com/tutorials/wp-content/uploads/2021/04/image-32-768x445.png 768w, https://www.scmgalaxy.com/tutorials/wp-content/uploads/2021/04/image-32.png 1255w" sizes="(max-width: 1024px) 100vw, 1024px" /></figure>



<p class="wp-block-paragraph">After that Your problem will be solve.</p>
<p>The post <a href="https://www.scmgalaxy.com/tutorials/how-to-solve-throwing-npm-error-npm-err-code-elifecycle-npm-err-errno-2-npm-err-dev-npm-run-development/">How to solve throwing npm error “npm ERR! code ELIFECYCLE” &#8220;npm ERR! errno 2&#8221; &#8220;npm ERR! @ dev: `npm run development`&#8221;</a> appeared first on <a href="https://www.scmgalaxy.com/tutorials">scmGalaxy</a>.</p>
]]></content:encoded>
					
		
		
			</item>
	</channel>
</rss>
