<?xml version="1.0" encoding="UTF-8"?><rss version="2.0"
	xmlns:content="http://purl.org/rss/1.0/modules/content/"
	xmlns:wfw="http://wellformedweb.org/CommentAPI/"
	xmlns:dc="http://purl.org/dc/elements/1.1/"
	xmlns:atom="http://www.w3.org/2005/Atom"
	xmlns:sy="http://purl.org/rss/1.0/modules/syndication/"
	xmlns:slash="http://purl.org/rss/1.0/modules/slash/"
	>

<channel>
	<title>npm Archives - scmGalaxy</title>
	<atom:link href="https://www.scmgalaxy.com/tutorials/tag/npm/feed/" rel="self" type="application/rss+xml" />
	<link>https://www.scmgalaxy.com/tutorials/tag/npm/</link>
	<description>A Platform for Software Engineers</description>
	<lastBuildDate>Wed, 13 Apr 2022 16:34:47 +0000</lastBuildDate>
	<language>en-US</language>
	<sy:updatePeriod>
	hourly	</sy:updatePeriod>
	<sy:updateFrequency>
	1	</sy:updateFrequency>
	<generator>https://wordpress.org/?v=7.1</generator>
	<item>
		<title>npm run dev issue (npm ERR! code ELIFECYCLE)</title>
		<link>https://www.scmgalaxy.com/tutorials/npm-run-dev-issue-npm-err-code-elifecycle/</link>
					<comments>https://www.scmgalaxy.com/tutorials/npm-run-dev-issue-npm-err-code-elifecycle/#respond</comments>
		
		<dc:creator><![CDATA[Ashwani Kumar]]></dc:creator>
		<pubDate>Thu, 12 Aug 2021 13:26:22 +0000</pubDate>
				<category><![CDATA[Uncategorized]]></category>
		<category><![CDATA[npm]]></category>
		<category><![CDATA[NPM error]]></category>
		<category><![CDATA[npm error issue]]></category>
		<category><![CDATA[npm run dev issue]]></category>
		<category><![CDATA[npm run dev problem]]></category>
		<guid isPermaLink="false">https://www.scmgalaxy.com/tutorials/?p=7851</guid>

					<description><![CDATA[<p>Error:- Solution:- Step 1:- Run this command to verify cache Step 2:- Recheck your package.json and webpack.mix.js file it is [&#8230;]</p>
<p>The post <a href="https://www.scmgalaxy.com/tutorials/npm-run-dev-issue-npm-err-code-elifecycle/">npm run dev issue (npm ERR! code ELIFECYCLE)</a> appeared first on <a href="https://www.scmgalaxy.com/tutorials">scmGalaxy</a>.</p>
]]></description>
										<content:encoded><![CDATA[
<p class="wp-block-paragraph"><strong>Error:-</strong></p>



<pre class="wp-block-code"><code><span class="has-inline-color has-vivid-red-color">> cross-env NODE_ENV=development node_modules/webpack/bin/webpack.js --progress --hide-modules --config=node_modules/laravel-mix/setup/webpack.config.js

&#91;webpack-cli] Error: Unknown option '--hide-modules'
&#91;webpack-cli] Run 'webpack --help' to see available commands and options
npm ERR! code ELIFECYCLE
npm ERR! errno 2
npm ERR! @ development: `cross-env NODE_ENV=development node_modules/webpack/bin/webpack.js --progress --hide-modules --config=node_modules/laravel-mix/setup/webpack.config.js`
npm ERR! Exit status 2
npm ERR!
npm ERR! Failed at the @ development script.
npm ERR! This is probably not a problem with npm. There is likely additional logging output above.

npm ERR! A complete log of this run can be found in:
npm ERR!     C:\Users\Cotocus5\AppData\Roaming\npm-cache\_logs\2021-08-12T12_23_56_189Z-debug.log
npm ERR! code ELIFECYCLE
npm ERR! errno 2
npm ERR! @ dev: `npm run development`
npm ERR! Exit status 2
npm ERR!
npm ERR! Failed at the @ dev script.
npm ERR! This is probably not a problem with npm. There is likely additional logging output above.

npm ERR! A complete log of this run can be found in:
npm ERR!     C:\Users\Cotocus5\AppData\Roaming\npm-cache\_logs\2021-08-12T12_23_56_273Z-debug.log
</span></code></pre>



<p class="wp-block-paragraph"><strong>Solution:-</strong></p>



<p class="wp-block-paragraph"><strong>Step 1:-</strong> Run this command to verify cache</p>



<pre class="wp-block-code"><code><code><span class="has-inline-color has-vivid-purple-color"><strong>npm cache verify</strong></span></code></code></pre>



<p class="wp-block-paragraph"><strong>Step 2:-</strong> Recheck your <strong>package.json</strong> and <strong>webpack.mix.js</strong> file it is correct or not.</p>



<p class="wp-block-paragraph"><strong>Step 3:-</strong> Then Delete the Node Module file which is present in your project folder.</p>



<p class="wp-block-paragraph"><strong>Step 4:-</strong> Run the Npm install command.</p>



<pre class="wp-block-code"><code><strong><span class="has-inline-color has-vivid-purple-color">npm install</span></strong></code></pre>



<p class="wp-block-paragraph"><strong>Step 5:-</strong> Then Run npm run dev command.</p>



<pre class="wp-block-code"><code><strong><span class="has-inline-color has-vivid-purple-color">npm run dev</span></strong></code></pre>
<p>The post <a href="https://www.scmgalaxy.com/tutorials/npm-run-dev-issue-npm-err-code-elifecycle/">npm run dev issue (npm ERR! code ELIFECYCLE)</a> appeared first on <a href="https://www.scmgalaxy.com/tutorials">scmGalaxy</a>.</p>
]]></content:encoded>
					
					<wfw:commentRss>https://www.scmgalaxy.com/tutorials/npm-run-dev-issue-npm-err-code-elifecycle/feed/</wfw:commentRss>
			<slash:comments>0</slash:comments>
		
		
			</item>
		<item>
		<title>error in ./resources/assets/sass/app.scss</title>
		<link>https://www.scmgalaxy.com/tutorials/error-in-resources-assets-sass-app-scss/</link>
					<comments>https://www.scmgalaxy.com/tutorials/error-in-resources-assets-sass-app-scss/#respond</comments>
		
		<dc:creator><![CDATA[Ashwani Kumar]]></dc:creator>
		<pubDate>Sat, 07 Aug 2021 12:05:32 +0000</pubDate>
				<category><![CDATA[Node js]]></category>
		<category><![CDATA[dart-sass]]></category>
		<category><![CDATA[error in ./resources/assets/sass/app.scss]]></category>
		<category><![CDATA[Node]]></category>
		<category><![CDATA[node-sass]]></category>
		<category><![CDATA[node-sass not found]]></category>
		<category><![CDATA[nodejs]]></category>
		<category><![CDATA[not found]]></category>
		<category><![CDATA[npm]]></category>
		<category><![CDATA[npm err!]]></category>
		<category><![CDATA[NPM error]]></category>
		<category><![CDATA[npm run development]]></category>
		<guid isPermaLink="false">https://www.scmgalaxy.com/tutorials/?p=7586</guid>

					<description><![CDATA[<p>If you are getting this error (error in ./resources/assets/sass/app.scss) in Node module please follow some steps which is have mentioned [&#8230;]</p>
<p>The post <a href="https://www.scmgalaxy.com/tutorials/error-in-resources-assets-sass-app-scss/">error in ./resources/assets/sass/app.scss</a> appeared first on <a href="https://www.scmgalaxy.com/tutorials">scmGalaxy</a>.</p>
]]></description>
										<content:encoded><![CDATA[
<p class="wp-block-paragraph">If you are getting this error (error in ./resources/assets/sass/app.scss) in Node module please follow some steps which is have mentioned in the following</p>



<h4 class="wp-block-heading">Error:-</h4>



<p class="wp-block-paragraph">Many of you get this error when you did not change anything in <code>app.scss</code>, but when I run <code>npm run watch</code> I get the following errors:</p>



<pre class="wp-block-code"><code><span class="has-inline-color has-vivid-cyan-blue-color"> error  in ./resources/sass/app.scss                                                                      

Module build failed (from ./node_modules/sass-loader/lib/loader.js):                                      
Unsupported operation: Cannot extract a file path from a URI with a fragment component                    

@ ./resources/sass/app.scss 2:14-254                                                                     

    Asset      Size   Chunks             Chunk Names                                                     
/js/app.js  2.46 MiB  /js/app  &#91;emitted]  /js/app                                                         

ERROR in ./resources/sass/app.scss                                                                        
Module build failed (from ./node_modules/css-loader/index.js):                                            
ModuleBuildError: Module build failed (from ./node_modules/sass-loader/lib/loader.js):                    

undefined                                                                                                 
      ^                                                                                                  
      Join(null, "variables"): part 0 was null, but part 1 was not.                                       
@import 'variables';                                                                                      
        ^^^^^^^^^^^                                                                                       
  stdin 2:9  root stylesheet                                                                              
      in C:\Users\TAQI VAHEED\Desktop\#Coding\resPro\resources\sass\app.scss (line 2, column 9)           
    at runLoaders (C:\Users\TAQI VAHEED\Desktop\#Coding\resPro\node_modules\webpack\lib\NormalModule.js:30
    at C:\Users\TAQI VAHEED\Desktop\#Coding\resPro\node_modules\loader-runner\lib\LoaderRunner.js:364:11  
    at C:\Users\TAQI VAHEED\Desktop\#Coding\resPro\node_modules\loader-runner\lib\LoaderRunner.js:230:18  
    at context.callback (C:\Users\TAQI VAHEED\Desktop\#Coding\resPro\node_modules\loader-runner\lib\Loader
13)</span></code></pre>



<h4 class="wp-block-heading">Solution:-</h4>



<p class="wp-block-paragraph">The main issue which we have found that is related to<code><span class="has-inline-color has-vivid-red-color"> dart-sass</span></code> being used instead of <code><span class="has-inline-color has-vivid-red-color">node-sass</span></code> with <code>laravel</code></p>



<p class="wp-block-paragraph">You have to just follow one step:-</p>



<p class="wp-block-paragraph"><strong>Step 1:-</strong> You have to run this Command and all the things will solve .</p>



<pre class="wp-block-code"><code><span class="has-inline-color has-vivid-red-color">npm install node-sass</span></code></pre>



<p class="wp-block-paragraph"></p>
<p>The post <a href="https://www.scmgalaxy.com/tutorials/error-in-resources-assets-sass-app-scss/">error in ./resources/assets/sass/app.scss</a> appeared first on <a href="https://www.scmgalaxy.com/tutorials">scmGalaxy</a>.</p>
]]></content:encoded>
					
					<wfw:commentRss>https://www.scmgalaxy.com/tutorials/error-in-resources-assets-sass-app-scss/feed/</wfw:commentRss>
			<slash:comments>0</slash:comments>
		
		
			</item>
		<item>
		<title>&#8216;cross-env&#8217; is not recognized as an internal or external command, operable program or batch file.</title>
		<link>https://www.scmgalaxy.com/tutorials/cross-env-is-not-recognized-as-an-internal-or-external-command-operable-program-or-batch-file/</link>
					<comments>https://www.scmgalaxy.com/tutorials/cross-env-is-not-recognized-as-an-internal-or-external-command-operable-program-or-batch-file/#respond</comments>
		
		<dc:creator><![CDATA[Ashwani Kumar]]></dc:creator>
		<pubDate>Sat, 07 Aug 2021 11:48:32 +0000</pubDate>
				<category><![CDATA[Uncategorized]]></category>
		<category><![CDATA[cross-env]]></category>
		<category><![CDATA[Node]]></category>
		<category><![CDATA[node error]]></category>
		<category><![CDATA[nodejs]]></category>
		<category><![CDATA[not recognized]]></category>
		<category><![CDATA[npm]]></category>
		<category><![CDATA[npm err!]]></category>
		<category><![CDATA[NPM error]]></category>
		<guid isPermaLink="false">https://www.scmgalaxy.com/tutorials/?p=7571</guid>

					<description><![CDATA[<p>Hey if you are getting some error like (&#8216;cross-env&#8217; is not recognized as an internal or external command, operable program [&#8230;]</p>
<p>The post <a href="https://www.scmgalaxy.com/tutorials/cross-env-is-not-recognized-as-an-internal-or-external-command-operable-program-or-batch-file/">&#8216;cross-env&#8217; is not recognized as an internal or external command, operable program or batch file.</a> appeared first on <a href="https://www.scmgalaxy.com/tutorials">scmGalaxy</a>.</p>
]]></description>
										<content:encoded><![CDATA[
<p class="wp-block-paragraph">Hey if  you are getting some error like (&#8216;cross-env&#8217; is not recognized as an internal or external command, operable program or batch file.) in your Node please follow the steps which i have mentioned in following:-</p>



<p class="wp-block-paragraph"><strong>You need to make cross-env working globally instead of having it in the project.</strong></p>



<p class="wp-block-paragraph"><strong>Step 1:-</strong> remove <strong><code>node_modules</code></strong> folder</p>



<p class="wp-block-paragraph"><strong>Step 2:-</strong>  run this Command so that you <strong>cross-env </strong>work globally.</p>



<pre class="wp-block-code"><code><span class="has-inline-color has-vivid-red-color">npm install --global cross-env</span></code></pre>



<p class="wp-block-paragraph"><strong>Step 3:-</strong> Remove &#8220;cross-env&#8221;: &#8220;5.0.1&#8221; from the devDependencies section of the package.json file. You may actually skip this step and keep package.json. If you&#8217;d want.</p>



<p class="wp-block-paragraph"><strong>Step 4:-</strong> Then run this command.</p>



<pre class="wp-block-code"><code><span class="has-inline-color has-vivid-red-color">npm install --no-bin-links</span></code></pre>



<p class="wp-block-paragraph"><strong>Step 5:-</strong> After this finally you can run your main command </p>



<pre class="wp-block-code"><code><span class="has-inline-color has-vivid-red-color">npm run dev</span></code></pre>



<p class="wp-block-paragraph"></p>
<p>The post <a href="https://www.scmgalaxy.com/tutorials/cross-env-is-not-recognized-as-an-internal-or-external-command-operable-program-or-batch-file/">&#8216;cross-env&#8217; is not recognized as an internal or external command, operable program or batch file.</a> appeared first on <a href="https://www.scmgalaxy.com/tutorials">scmGalaxy</a>.</p>
]]></content:encoded>
					
					<wfw:commentRss>https://www.scmgalaxy.com/tutorials/cross-env-is-not-recognized-as-an-internal-or-external-command-operable-program-or-batch-file/feed/</wfw:commentRss>
			<slash:comments>0</slash:comments>
		
		
			</item>
		<item>
		<title>ERROR Failed to compile with 8 errors (Running ❯ npm run dev Failed to compile with 1 errors Unexpected token)</title>
		<link>https://www.scmgalaxy.com/tutorials/error-failed-to-compile-with-8-errors-running-%e2%9d%af-npm-run-dev-failed-to-compile-with-1-errors-unexpected-token/</link>
		
		<dc:creator><![CDATA[rajeshkumar]]></dc:creator>
		<pubDate>Sat, 24 Apr 2021 11:15:19 +0000</pubDate>
				<category><![CDATA[Laravel]]></category>
		<category><![CDATA[Compile]]></category>
		<category><![CDATA[laravel]]></category>
		<category><![CDATA[npm]]></category>
		<category><![CDATA[unexpected_token]]></category>
		<guid isPermaLink="false">https://www.scmgalaxy.com/tutorials/?p=5978</guid>

					<description><![CDATA[<p>When you using &#8220;laravel 5.5&#8221; and changes in &#8220;resourse/asset&#8221; after that run commands &#8220;npm run dev&#8221; then showing this error. [&#8230;]</p>
<p>The post <a href="https://www.scmgalaxy.com/tutorials/error-failed-to-compile-with-8-errors-running-%e2%9d%af-npm-run-dev-failed-to-compile-with-1-errors-unexpected-token/">ERROR Failed to compile with 8 errors (Running ❯ npm run dev Failed to compile with 1 errors Unexpected token)</a> appeared first on <a href="https://www.scmgalaxy.com/tutorials">scmGalaxy</a>.</p>
]]></description>
										<content:encoded><![CDATA[
<p class="wp-block-paragraph">When you using &#8220;laravel 5.5&#8221; and changes in &#8220;resourse/asset&#8221; after that run commands &#8220;npm run dev&#8221; then showing this error.</p>



<figure class="wp-block-image size-large"><img fetchpriority="high" decoding="async" width="1024" height="257" src="https://www.scmgalaxy.com/tutorials/wp-content/uploads/2021/04/ERROR-Failed-to-compile-with-8-errors-Running-❯-npm-run-dev-Failed-1024x257.png" alt="" class="wp-image-5979" srcset="https://www.scmgalaxy.com/tutorials/wp-content/uploads/2021/04/ERROR-Failed-to-compile-with-8-errors-Running-❯-npm-run-dev-Failed-1024x257.png 1024w, https://www.scmgalaxy.com/tutorials/wp-content/uploads/2021/04/ERROR-Failed-to-compile-with-8-errors-Running-❯-npm-run-dev-Failed-300x75.png 300w, https://www.scmgalaxy.com/tutorials/wp-content/uploads/2021/04/ERROR-Failed-to-compile-with-8-errors-Running-❯-npm-run-dev-Failed-768x193.png 768w, https://www.scmgalaxy.com/tutorials/wp-content/uploads/2021/04/ERROR-Failed-to-compile-with-8-errors-Running-❯-npm-run-dev-Failed-1536x386.png 1536w, https://www.scmgalaxy.com/tutorials/wp-content/uploads/2021/04/ERROR-Failed-to-compile-with-8-errors-Running-❯-npm-run-dev-Failed.png 1795w" sizes="(max-width: 1024px) 100vw, 1024px" /></figure>



<p class="wp-block-paragraph">Then run below commands &#8211;</p>



<h2 class="wp-block-heading">Step-1</h2>



<p class="wp-block-paragraph"><strong>npm rebuild node-sass</strong></p>



<p class="wp-block-paragraph"></p>



<h2 class="wp-block-heading">Step -2</h2>



<p class="wp-block-paragraph"><strong>npm run dev</strong></p>



<figure class="wp-block-image size-large"><img decoding="async" width="1024" height="175" src="https://www.scmgalaxy.com/tutorials/wp-content/uploads/2021/04/image-31-1024x175.png" alt="" class="wp-image-5986" srcset="https://www.scmgalaxy.com/tutorials/wp-content/uploads/2021/04/image-31-1024x175.png 1024w, https://www.scmgalaxy.com/tutorials/wp-content/uploads/2021/04/image-31-300x51.png 300w, https://www.scmgalaxy.com/tutorials/wp-content/uploads/2021/04/image-31-768x131.png 768w, https://www.scmgalaxy.com/tutorials/wp-content/uploads/2021/04/image-31.png 1432w" sizes="(max-width: 1024px) 100vw, 1024px" /></figure>



<p class="wp-block-paragraph">After that you project will be run.</p>
<p>The post <a href="https://www.scmgalaxy.com/tutorials/error-failed-to-compile-with-8-errors-running-%e2%9d%af-npm-run-dev-failed-to-compile-with-1-errors-unexpected-token/">ERROR Failed to compile with 8 errors (Running ❯ npm run dev Failed to compile with 1 errors Unexpected token)</a> appeared first on <a href="https://www.scmgalaxy.com/tutorials">scmGalaxy</a>.</p>
]]></content:encoded>
					
		
		
			</item>
		<item>
		<title>npm &#8211; Node Packaged Modules</title>
		<link>https://www.scmgalaxy.com/tutorials/npm-node-packaged-modules/</link>
					<comments>https://www.scmgalaxy.com/tutorials/npm-node-packaged-modules/#respond</comments>
		
		<dc:creator><![CDATA[scmgalaxy K]]></dc:creator>
		<pubDate>Tue, 09 Jan 2018 09:14:31 +0000</pubDate>
				<category><![CDATA[Concept & Definition]]></category>
		<category><![CDATA[Node Package installation Commands]]></category>
		<category><![CDATA[Node Packaged Modules]]></category>
		<category><![CDATA[npm]]></category>
		<category><![CDATA[Package]]></category>
		<guid isPermaLink="false">http://www.scmgalaxy.com/tutorials/?p=4634</guid>

					<description><![CDATA[<p>Install a package SYNOPSIS npm install (with no args in a package dir) npm install &#60;tarball file&#62; npm install &#60;tarball [&#8230;]</p>
<p>The post <a href="https://www.scmgalaxy.com/tutorials/npm-node-packaged-modules/">npm &#8211; Node Packaged Modules</a> appeared first on <a href="https://www.scmgalaxy.com/tutorials">scmGalaxy</a>.</p>
]]></description>
										<content:encoded><![CDATA[<p>Install a package<br />
SYNOPSIS</p>
<p>npm install (with no args in a package dir)<br />
npm install &lt;tarball file&gt;<br />
npm install &lt;tarball url&gt;<br />
npm install &lt;folder&gt;<br />
npm install &lt;name&gt; [&#8211;save|&#8211;save-dev|&#8211;save-optional]<br />
npm install &lt;name&gt;@&lt;tag&gt;<br />
npm install &lt;name&gt;@&lt;version&gt;<br />
npm install &lt;name&gt;@&lt;version range&gt;<br />
npm i (with any of the previous argument usage)</p>
<p>This command installs a package, and any packages that it depends on. If the package has a shrinkwrap file, the installation of dependencies will be driven by that. See npm-shrinkwrap(1).</p>
<p>A package is:</p>
<p>a) a folder containing a program described by a package.json file<br />
b) a gzipped tarball containing (a)<br />
c) a url that resolves to (b)<br />
d) a &lt;name&gt;@&lt;version&gt; that is published on the registry with (c)<br />
e) a &lt;name&gt;@&lt;tag&gt; that points to (d)<br />
f) a &lt;name&gt; that has a &#8220;latest&#8221; tag satisfying (e)<br />
g) a &lt;git remote url&gt; that resolves to (b)</p>
<p>Even if you never publish your package, you can still get a lot of benefits of using npm if you just want to write a node program (a), and perhaps if you also want to be able to easily install it elsewhere after packing it up into a tarball (b).</p>
<p>&nbsp;</p>
<p><strong>More info &#8230;</strong></p>
<p><a href="https://npmjs.org/doc/install.html" rel="nofollow">https://npmjs.org/doc/install.html</a></p>
<p>The post <a href="https://www.scmgalaxy.com/tutorials/npm-node-packaged-modules/">npm &#8211; Node Packaged Modules</a> appeared first on <a href="https://www.scmgalaxy.com/tutorials">scmGalaxy</a>.</p>
]]></content:encoded>
					
					<wfw:commentRss>https://www.scmgalaxy.com/tutorials/npm-node-packaged-modules/feed/</wfw:commentRss>
			<slash:comments>0</slash:comments>
		
		
			</item>
		<item>
		<title>Npm module &#8220;grunt-open&#8221; not found. Is it installed?</title>
		<link>https://www.scmgalaxy.com/tutorials/npm-module-grunt-open-not-found-is-it-installed/</link>
					<comments>https://www.scmgalaxy.com/tutorials/npm-module-grunt-open-not-found-is-it-installed/#respond</comments>
		
		<dc:creator><![CDATA[scmgalaxy K]]></dc:creator>
		<pubDate>Sat, 09 Dec 2017 07:29:03 +0000</pubDate>
				<category><![CDATA[test coverage tools]]></category>
		<category><![CDATA[npm]]></category>
		<guid isPermaLink="false">http://www.scmgalaxy.com/tutorials/?p=2587</guid>

					<description><![CDATA[<p>scmuser created the topic: Npm module &#8220;grunt-open&#8221; not found. Is it installed? I am getting following error&#8230;</p>
<p>The post <a href="https://www.scmgalaxy.com/tutorials/npm-module-grunt-open-not-found-is-it-installed/">Npm module &#8220;grunt-open&#8221; not found. Is it installed?</a> appeared first on <a href="https://www.scmgalaxy.com/tutorials">scmGalaxy</a>.</p>
]]></description>
										<content:encoded><![CDATA[<p><strong>scmuser created the topic: Npm module &#8220;grunt-open&#8221; not found. Is it installed?</strong></p>
<p>I am getting following error&#8230;</p>
<pre class="brush: css; title: ; notranslate">
grunt lite
&#x5B;31m&gt;&gt; &#x5B;39mLocal Npm module &quot;grunt-open&quot; not found. Is it installed?
Loading &quot;nodestatic.js&quot; tasks...&#x5B;31mERROR&#x5B;39m
&#x5B;31m&gt;&gt; &#x5B;39mError: Cannot find module 'node-static'
&#x5B;31m&gt;&gt; &#x5B;39mLocal Npm module &quot;grunt-contrib-jshint&quot; not found. Is it installed?
&#x5B;31m&gt;&gt; &#x5B;39mLocal Npm module &quot;grunt-exec&quot; not found. Is it installed?
&#x5B;31m&gt;&gt; &#x5B;39mLocal Npm module &quot;grunt-contrib-copy&quot; not found. Is it installed?
&#x5B;31m&gt;&gt; &#x5B;39mLocal Npm module &quot;grunt-contrib-compass&quot; not found. Is it installed?
&#x5B;31m&gt;&gt; &#x5B;39mLocal Npm module &quot;grunt-contrib-watch&quot; not found. Is it installed?
&#x5B;31m&gt;&gt; &#x5B;39mLocal Npm module &quot;grunt-contrib-symlink&quot; not found. Is it installed?
&#x5B;31m&gt;&gt; &#x5B;39mLocal Npm module &quot;grunt-istanbul&quot; not found. Is it installed?
&#x5B;31m&gt;&gt; &#x5B;39mLocal Npm module &quot;intern&quot; not found. Is it installed?
Loading &quot;Gruntfile.js&quot; tasks...&#x5B;31mERROR&#x5B;39m
&#x5B;31m&gt;&gt; &#x5B;39mError: Task &quot;exec:installdeps&quot; not found.
&#x5B;33mWarning: Task &quot;lite&quot; not found. Use --force to continue.&#x5B;39m

&#x5B;31mAborted due to warnings.&#x5B;39m
</pre>
<p>The post <a href="https://www.scmgalaxy.com/tutorials/npm-module-grunt-open-not-found-is-it-installed/">Npm module &#8220;grunt-open&#8221; not found. Is it installed?</a> appeared first on <a href="https://www.scmgalaxy.com/tutorials">scmGalaxy</a>.</p>
]]></content:encoded>
					
					<wfw:commentRss>https://www.scmgalaxy.com/tutorials/npm-module-grunt-open-not-found-is-it-installed/feed/</wfw:commentRss>
			<slash:comments>0</slash:comments>
		
		
			</item>
		<item>
		<title>npm ERR! Error: No compatible version found: restful-client@&#8217;&gt;=0.1.0-</title>
		<link>https://www.scmgalaxy.com/tutorials/npm-err-error-no-compatible-version-found-restful-client0-1-0/</link>
					<comments>https://www.scmgalaxy.com/tutorials/npm-err-error-no-compatible-version-found-restful-client0-1-0/#respond</comments>
		
		<dc:creator><![CDATA[scmgalaxy K]]></dc:creator>
		<pubDate>Wed, 06 Dec 2017 08:40:24 +0000</pubDate>
				<category><![CDATA[Uncategorized]]></category>
		<category><![CDATA[npm]]></category>
		<guid isPermaLink="false">http://www.scmgalaxy.com/tutorials/?p=1833</guid>

					<description><![CDATA[<p>rajeshkumar created the topic: npm ERR! Error: No compatible version found: restful-client@&#8217;>=0.1.0- Error during npm install node-gitlab rajesh@mahto:~$ npm install [&#8230;]</p>
<p>The post <a href="https://www.scmgalaxy.com/tutorials/npm-err-error-no-compatible-version-found-restful-client0-1-0/">npm ERR! Error: No compatible version found: restful-client@&#8217;&gt;=0.1.0-</a> appeared first on <a href="https://www.scmgalaxy.com/tutorials">scmGalaxy</a>.</p>
]]></description>
										<content:encoded><![CDATA[<p><strong>rajeshkumar created the topic: npm ERR! Error: No compatible version found: restful-client@&#8217;>=0.1.0-</strong><br />
Error during npm install node-gitlab<br />
rajesh@mahto:~$ npm install node-gitlab<br />
npm http GET registry.npmjs.org/node-gitlab<br />
npm http 304 registry.npmjs.org/node-gitlab<br />
npm http GET registry.npmjs.org/debug<br />
npm http GET registry.npmjs.org/restful-client<br />
npm http 304 registry.npmjs.org/restful-client<br />
npm ERR! error installing node-gitlab@0.2.1</p>
<p>npm ERR! Error: No compatible version found: restful-client@&#8217;>=0.1.0- <0.2.0-'
npm ERR! No valid targets found.
npm ERR! Perhaps not compatible with your version of node?
npm ERR! at installTargetsError (/usr/share/npm/lib/cache.js:488:10)
npm ERR! at next_ (/usr/share/npm/lib/cache.js:438:17)
npm ERR! at next (/usr/share/npm/lib/cache.js:415:44)
npm ERR! at /usr/share/npm/lib/cache.js:408:5
npm ERR! at saved (/usr/share/npm/lib/utils/npm-registry-client/get.js:147:7)
npm ERR! at Object.oncomplete (/usr/lib/nodejs/graceful-fs.js:230:7)
npm ERR! You may report this log at:
npm ERR! < bugs.debian.org/npm ><br />
npm ERR! or use<br />
npm ERR! reportbug &#8211;attach /home/rajesh/npm-debug.log npm<br />
npm ERR!<br />
npm ERR! System Linux 3.8.0-34-generic<br />
npm ERR! command &#8220;/usr/bin/nodejs&#8221; &#8220;/usr/bin/npm&#8221; &#8220;install&#8221; &#8220;node-gitlab&#8221;<br />
npm ERR! cwd /home/rajesh<br />
npm ERR! node -v v0.6.19<br />
npm ERR! npm -v 1.1.4<br />
npm ERR! message No compatible version found: restful-client@&#8217;>=0.1.0- <0.2.0-'
npm ERR! message No valid targets found.
npm ERR! message Perhaps not compatible with your version of node?

npm ERR! Error: EACCES, open 'npm-debug.log'
npm ERR!
npm ERR! Please try running this command again as root/Administrator.
npm ERR!
npm ERR! System Linux 3.8.0-34-generic
npm ERR! command "/usr/bin/nodejs" "/usr/bin/npm" "install" "node-gitlab"
npm ERR! cwd /home/rajesh
npm ERR! node -v v0.6.19
npm ERR! npm -v 1.1.4
npm ERR! path npm-debug.log
npm ERR! code EACCES
npm ERR! message EACCES, open 'npm-debug.log'
npm ERR! errno {}
npm ERR!
npm ERR! Additional logging details can be found in:
npm ERR! /home/rajesh/npm-debug.log
npm not ok
Regards,
Rajesh Kumar
Twitt me @ <a href="http://twitter.com/RajeshKumarIn">twitter.com/RajeshKumarIn</a></p>
<p>The post <a href="https://www.scmgalaxy.com/tutorials/npm-err-error-no-compatible-version-found-restful-client0-1-0/">npm ERR! Error: No compatible version found: restful-client@&#8217;&gt;=0.1.0-</a> appeared first on <a href="https://www.scmgalaxy.com/tutorials">scmGalaxy</a>.</p>
]]></content:encoded>
					
					<wfw:commentRss>https://www.scmgalaxy.com/tutorials/npm-err-error-no-compatible-version-found-restful-client0-1-0/feed/</wfw:commentRss>
			<slash:comments>0</slash:comments>
		
		
			</item>
		<item>
		<title>npm ERR! error installing node-gitlab@0.2.1</title>
		<link>https://www.scmgalaxy.com/tutorials/npm-err-error-installing-node-gitlab0-2-1/</link>
					<comments>https://www.scmgalaxy.com/tutorials/npm-err-error-installing-node-gitlab0-2-1/#respond</comments>
		
		<dc:creator><![CDATA[scmgalaxy K]]></dc:creator>
		<pubDate>Wed, 06 Dec 2017 08:36:25 +0000</pubDate>
				<category><![CDATA[git]]></category>
		<category><![CDATA[npm]]></category>
		<guid isPermaLink="false">http://www.scmgalaxy.com/tutorials/?p=1829</guid>

					<description><![CDATA[<p>rajeshkumar created the topic: npm ERR! error installing node-gitlab@0.2.1 rajesh@mahto:~$ npm install node-gitlab npm http GET registry.npmjs.org/node-gitlab npm http 304 [&#8230;]</p>
<p>The post <a href="https://www.scmgalaxy.com/tutorials/npm-err-error-installing-node-gitlab0-2-1/">npm ERR! error installing node-gitlab@0.2.1</a> appeared first on <a href="https://www.scmgalaxy.com/tutorials">scmGalaxy</a>.</p>
]]></description>
										<content:encoded><![CDATA[<p><strong>rajeshkumar created the topic: npm ERR! error installing node-gitlab@0.2.1</strong><br />
rajesh@mahto:~$ npm install node-gitlab<br />
npm http GET <a href="http://registry.npmjs.org/node-gitlab">registry.npmjs.org/node-gitlab </a><br />
npm http 304 <a href="http://registry.npmjs.org/node-gitlab">registry.npmjs.org/node-gitlab</a><br />
npm http GET <a href="http://registry.npmjs.org/debug">registry.npmjs.org/debug</a><br />
npm http GET <a href="http://registry.npmjs.org/restful-client">registry.npmjs.org/restful-client</a><br />
npm http 304 <a href="http://registry.npmjs.org/restful-client">registry.npmjs.org/restful-client</a><br />
npm ERR! error installing node-gitlab@0.2.1</p>
<p>npm ERR! Error: No compatible version found: restful-client@&#8217;>=0.1.0- <0.2.0-'
npm ERR! No valid targets found.
npm ERR! Perhaps not compatible with your version of node?
npm ERR! at installTargetsError (/usr/share/npm/lib/cache.js:488:10)
npm ERR! at next_ (/usr/share/npm/lib/cache.js:438:17)
npm ERR! at next (/usr/share/npm/lib/cache.js:415:44)
npm ERR! at /usr/share/npm/lib/cache.js:408:5
npm ERR! at saved (/usr/share/npm/lib/utils/npm-registry-client/get.js:147:7)
npm ERR! at Object.oncomplete (/usr/lib/nodejs/graceful-fs.js:230:7)
npm ERR! You may report this log at:
npm ERR! < bugs.debian.org/npm ><br />
npm ERR! or use<br />
npm ERR! reportbug &#8211;attach /home/rajesh/npm-debug.log npm<br />
npm ERR!<br />
npm ERR! System Linux 3.8.0-34-generic<br />
npm ERR! command &#8220;/usr/bin/nodejs&#8221; &#8220;/usr/bin/npm&#8221; &#8220;install&#8221; &#8220;node-gitlab&#8221;<br />
npm ERR! cwd /home/rajesh<br />
npm ERR! node -v v0.6.19<br />
npm ERR! npm -v 1.1.4<br />
npm ERR! message No compatible version found: restful-client@&#8217;>=0.1.0- <0.2.0-'
npm ERR! message No valid targets found.
npm ERR! message Perhaps not compatible with your version of node?

npm ERR! Error: EACCES, open 'npm-debug.log'
npm ERR!
npm ERR! Please try running this command again as root/Administrator.
npm ERR!
npm ERR! System Linux 3.8.0-34-generic
npm ERR! command "/usr/bin/nodejs" "/usr/bin/npm" "install" "node-gitlab"
npm ERR! cwd /home/rajesh
npm ERR! node -v v0.6.19
npm ERR! npm -v 1.1.4
npm ERR! path npm-debug.log
npm ERR! code EACCES
npm ERR! message EACCES, open 'npm-debug.log'
npm ERR! errno {}
npm ERR!
npm ERR! Additional logging details can be found in:
npm ERR! /home/rajesh/npm-debug.log
npm not ok
rajesh@mahto:~$ npm -v
1.1.4
rajesh@mahto:~$ node -v
The program 'node' can be found in the following packages:
* node
* nodejs-legacy
Try: sudo apt-get install <selected package><br />
rajesh@mahto:~$ sudo apt-get install node<br />
Regards,<br />
Rajesh Kumar<br />
Twitt me @ <a href="http://twitter.com/RajeshKumarIn">twitter.com/RajeshKumarIn</a></p>
<p>The post <a href="https://www.scmgalaxy.com/tutorials/npm-err-error-installing-node-gitlab0-2-1/">npm ERR! error installing node-gitlab@0.2.1</a> appeared first on <a href="https://www.scmgalaxy.com/tutorials">scmGalaxy</a>.</p>
]]></content:encoded>
					
					<wfw:commentRss>https://www.scmgalaxy.com/tutorials/npm-err-error-installing-node-gitlab0-2-1/feed/</wfw:commentRss>
			<slash:comments>0</slash:comments>
		
		
			</item>
	</channel>
</rss>
